{"text_format":"1","workbook":"xlsx","n_sheets":7,"sheets":["Title","Questions","Priorities","Policies","dd","internal","intpol"],"not_rendered":{"charts":0,"images":3,"macros":1,"external_links":0,"defined_names":0,"comments":1,"pivot_tables":0},"unopened":[],"bounds":{"document_bytes":16777216,"sheet_cells":100000,"rows_first":2000,"rows_last":500,"rows_between":2000,"halvings":0,"cell_chars":16384,"cell_head_chars":4096},"cells_cut":0,"cells_raw":0,"read":"whole","date_system":"1900"}

{"sheet":"Title","index":0,"n_rows":17,"n_cols":11,"rows_kept":17,"cut":false,"hidden":false,"merged":[[17,2,17,14],[11,1,11,14],[12,1,12,14],[14,2,14,14],[15,2,15,14],[16,2,16,14]]}
[]
[]
[]
[]
[]
[]
[]
[]
[]
[null,null,null,null,null,"Self-evaluation tool"]
[]
[null,"The Self-Evaluation tool (SET) is a tool to help the publik adminstration  to measure their current level in the context of Digital Local Agenda. SET is one part of Common methodology towards DLA. Answers to the questions are translated within the tool into evaluation of the level of certain aspects of application of the e-society in tha area and, also, suggestions how the situation could be improved further. Decision on what will be applied is still left to the administration – the tool can only provide help for deciding."]
[null,"Questions may contribute to the evaluation of different priorities (up to 6) and each priority evaluation has input from several questions (2-5). This makes the tool more rough and less dependant on not answering all questions. Still, we suggest to try to answer to all questions."]
[null,"Instructions for using the tool: ",null,null,null,null,null,null,null,null,"NB! You must allow Macros"]
[null,null,"1. On Questions page answer the questions (column D, in some cases also E. The cells for answering have blue frameline.  All cells for answering have a choice from prefixed values, that opens when you click the cell /(arrow down on right side of the cell). Empty cells are considered \"question not answered\" and do not affect the priority score. So, to make sure the question affects the result, also tick \"No\" or \"Do not Know\" when you do not want to answer \"Yes\". While using the tool repeatedly, please push the \"Clean the answers\" button before next attempt. In cell F1 on Questions page the count of Priorities still with No score is shown. Correct priority ranking assumes score for all priorities."]
[null,null,"2. On priorities page push the \"Do priority ranking\" button. This finishes calculations in the tool and you can see the scores for all priorities and also the priorities with the highest and lowest scores."]
[null,null,"3. On policies page consider the suggested policy options. "]

{"sheet":"Questions","index":1,"n_rows":91,"n_cols":6,"rows_kept":91,"cut":false,"hidden":false,"merged":[[2,0,2,1],[8,3,8,4],[9,3,9,4],[3,3,3,4],[4,3,4,4],[5,3,5,4],[6,3,6,4],[7,3,7,4]]}
["Code","Question",null,"Answer in cells with blue frame","Priorities with no score",{"$f":"COUNTIF(Priorities!C3:C23,\"\")","v":21}]
[]
["Contact data (this block has no impact to the evaluation and is useful only for the case of revisiting the answers by the public administration istelf)"]
[null,"Organisation Name and address"]
[null,"Website"]
[null,"City, Country"]
[null,"Contact person , email"]
[null,"Your position within the institution"]
[null,"Type of institution"]
[null,"Level of operation"]
[201,"Does you organisation have an ICT development plan?"]
[203,"When was the ICT development plan adopted and how often is it revised?"]
[209,"Is there a monitoring and evaluation scheme associated with the ICT development plan?"]
[303,"Percentage of computers connected to the internet?"]
[326,"Do you have dial-in or VPN connection possibility to use your network resources from outside the office?"]
[305,"Are the computers connected by Local Area Network? Provide % LAN connected workplaces."]
[306,"Is data stored centrally in servers accessible through LAN?"]
[307,"Are there any backup systems used?"]
[308,"Are there special servers dedicated only for supporting public services online?"]
[309,"Are security issues and firewall adressed on regular basis? "]
{"$rows_left_out":72}
{"sheet":"Priorities","index":2,"n_rows":33,"n_cols":7,"rows_kept":33,"cut":false,"hidden":false,"merged":[[24,0,24,1],[29,0,29,1]]}
[null,"Priority","Score","Score_abs","Rank"]
[null,null,null,10]
[1,"Automation offices and creation of internal databases",{"$f":"internal!P2","v":""},{"$f":"C3","v":""},{"$f":"_xlfn.RANK.AVG(C3,C$3:C$23)","v":{"$error":"#VALUE!"}},null,"Average score"]
[2,"Network security plan",{"$f":"internal!P3","v":""},{"$f":"C4","v":""},{"$error":"#VALUE!"},null,{"$f":"AVERAGE(C3:C23)","v":{"$error":"#DIV/0!"}}]
[3,"Website development",{"$f":"internal!P4","v":""},"",{"$error":"#VALUE!"}]
[4,"Transparency toward citizens on public documents and administrative transparency",{"$f":"internal!P5","v":""},"",{"$error":"#VALUE!"},null,"Median score"]
[5,"Survey on digital level of other institutions and possible collaboration",{"$f":"internal!P6","v":""},"",{"$error":"#VALUE!"},null,{"$f":"MEDIAN(C3:C23)","v":{"$error":"#NUM!"}}]
[6,"Development of an Intranet, a computer network that uses Internet Protocol technology to securely share any part of an organization's information",{"$f":"internal!P7","v":""},"",{"$error":"#VALUE!"}]
[7,"Open source strategy for development of new products and services ",{"$f":"internal!P8","v":""},"",{"$error":"#VALUE!"}]
[8,"Analysis of infrastructural enabling services needed for development of advanced services ICT-based",{"$f":"internal!P9","v":""},"",{"$error":"#VALUE!"}]
[9,"ICT skills of PAs",{"$f":"internal!P10","v":""},"",{"$error":"#VALUE!"}]
[10,"Stand alone services on web site",{"$f":"internal!P11","v":""},"",{"$error":"#VALUE!"}]
[11,"Consultation via web to citizens, local enterprises and community organisations on specific issues",{"$f":"internal!P12","v":""},"",{"$error":"#VALUE!"}]
[12,"Extranet with other institutions and development of integrated services (e.g. call center, common databases),  workflow management of internal procedures",{"$f":"internal!P13","v":""},"",{"$error":"#VALUE!"}]
[13,"Participation to civic networks / Pilot projects for services with other entities",{"$f":"internal!P14","v":""},"",{"$error":"#VALUE!"}]
[14,"Interactive services with citizens and SMEs (on-line front offices)",{"$f":"internal!P15","v":""},"",{"$error":"#VALUE!"}]
[15,"Local web portal and multi-channel services",{"$f":"internal!P16","v":""},"",{"$error":"#VALUE!"}]
[16,"E.participation initiatives",{"$f":"internal!P17","v":""},"",{"$error":"#VALUE!"}]
[17,"Transnational e.government services",{"$f":"internal!P18","v":""},"",{"$error":"#VALUE!"}]
[18,"Workflow management of internal procedures",{"$f":"internal!P19","v":""},"",{"$error":"#VALUE!"}]
{"$rows_left_out":14}
{"sheet":"Policies","index":3,"n_rows":231,"n_cols":4,"rows_kept":231,"cut":false,"hidden":false,"merged":[[168,1,170,1],[222,1,224,1],[225,1,227,1],[228,1,230,1],[188,1,190,1],[192,1,194,1],[195,1,197,1],[198,1,200,1],[202,1,204,1],[205,1,207,1],[105,1,107,1],[108,1,110,1],[172,1,174,1],[122,1,124,1],[125,1,127,1],[128,1,130,1],[132,1,134,1],[135,1,137,1],[138,1,140,1],[142,1,144,1],[145,1,147,1],[148,1,150,1],[155,1,157,1],[158,1,160,1],[162,1,164,1],[165,1,167,1],[42,1,44,1],[45,1,47,1],[48,1,50,1],[52,1,54,1],[55,1,57,1],[58,1,60,1],[212,1,214,1],[215,1,217,1],[218,1,220,1],[22,1,24,1],[25,1,27,1],[28,1,30,1],[32,1,34,1],[35,1,37,1],[38,1,40,1],[208,1,210,1],[182,1,184,1],[185,1,187,1],[175,1,177,1],[178,1,180,1],[152,1,154,1],[115,1,117,1],[62,1,64,1],[65,1,67,1],[68,1,70,1],[118,1,120,1],[72,1,74,1],[112,1,114,1],[75,1,77,1],[78,1,80,1],[82,1,84,1],[85,1,87,1],[88,1,90,1],[92,1,94,1],[95,1,97,1],[98,1,100,1],[102,1,104,1]]}
["For the most efficient development of DLA you might consider the following:"]
[null,null,null,{"$f":"INDEX(intpol!D$11:D$219,internal!R29)","v":{"$error":"#VALUE!"}}]
[null,null,null,{"$f":"INDEX(intpol!D$11:D$219,internal!S29)","v":{"$error":"#VALUE!"}}]
[null,null,null,{"$f":"INDEX(intpol!D$11:D$219,internal!T29)","v":{"$error":"#VALUE!"}}]
[null,null,null,{"$f":"INDEX(intpol!D$11:D$219,internal!R30)","v":{"$error":"#VALUE!"}}]
[null,null,null,{"$f":"INDEX(intpol!D$11:D$219,internal!S30)","v":{"$error":"#VALUE!"}}]
[null,null,null,{"$f":"INDEX(intpol!D$11:D$219,internal!T30)","v":{"$error":"#VALUE!"}}]
[null,null,null,{"$f":"INDEX(intpol!D$11:D$219,internal!R31)","v":{"$error":"#VALUE!"}}]
[null,null,null,{"$f":"INDEX(intpol!D$11:D$219,internal!S31)","v":{"$error":"#VALUE!"}}]
[null,null,null,{"$f":"INDEX(intpol!D$11:D$219,internal!T31)","v":{"$error":"#VALUE!"}}]
["For further development of what you are good at consider the following:"]
[null,null,null,{"$f":"INDEX(intpol!D$11:D$219,internal!R25)","v":{"$error":"#VALUE!"}}]
[null,null,null,{"$f":"INDEX(intpol!D$11:D$219,internal!S25)","v":{"$error":"#VALUE!"}}]
[null,null,null,{"$f":"INDEX(intpol!D$11:D$219,internal!T25)","v":{"$error":"#VALUE!"}}]
[null,null,null,{"$f":"INDEX(intpol!D$11:D$219,internal!R26)","v":{"$error":"#VALUE!"}}]
[null,null,null,{"$f":"INDEX(intpol!D$11:D$219,internal!S26)","v":{"$error":"#VALUE!"}}]
[null,null,null,{"$f":"INDEX(intpol!D$11:D$219,internal!T26)","v":{"$error":"#VALUE!"}}]
[null,null,null,{"$f":"INDEX(intpol!D$11:D$219,internal!R27)","v":{"$error":"#VALUE!"}}]
[null,null,null,{"$f":"INDEX(intpol!D$11:D$219,internal!S27)","v":{"$error":"#VALUE!"}}]
[null,null,null,{"$f":"INDEX(intpol!D$11:D$219,internal!T27)","v":{"$error":"#VALUE!"}}]
{"$rows_left_out":212}
{"sheet":"dd","index":4,"n_rows":34,"n_cols":9,"rows_kept":34,"cut":false,"hidden":false,"merged":[]}
["This page is for dropdown menus, while using the tool you do not need to touch it."]
[null,"% answers",null,201,"a) yes, it is followed",10,420,"a) no interest",0]
[null,0,null,null,"b) yes, but it is not followed",5,null,"b) no resources (time, money, skills)",1]
[null,10,null,null,"c) not ready yet, under planning",3,null,"c) there is no need",7]
[null,20,null,null,"d) no plan",0,null,"d) no problem, we use",10]
[null,30]
[null,40,null,203,"a) more than 5 years ago, revised (bi) annually",10,805,"a) daily",0]
[null,50,null,null,"b) more than 5 years ago, never revised",4,null,"b) weekly",1]
[null,60,null,null,"c) recently, not revised yet",8,null,"c) monthly",3]
[null,70,null,null,"d) no plan",0,null,"d) twice a year",7]
[null,80,null,null,null,null,null,"e) seldom",9]
[null,90,null,209,"a) yes, followed regularly",10,null,"f) no problem",10]
[null,100,null,null,"b) occasional",5]
[null,"na",null,null,"c) no",0,806,"a) weekly",10]
[null,null,null,null,null,null,null,"b) monthly",8]
[null,"yes",null,306,"a) yes, mostly",10,null,"c) twice a year",6]
[null,"no",null,807,"b) sometimes",5,null,"d) annually",4]
[null,"not in the competence of PA",null,null,"c) no",0,null,"e) occasionally when problems occur",2]
[null,null,null,null,null,null,null,"f) never",0]
[null,"yes",null,307,"a) yes, backup is regular automatic procedure",10]
{"$rows_left_out":15}
{"sheet":"internal","index":5,"n_rows":41,"n_cols":23,"rows_kept":41,"cut":false,"hidden":false,"merged":[]}
["This page is for calculations, while using the tool you do not need to touch it.",null,null,null,null,"Qcode",null,"scores",null,null,null,null,null,null,"Priority","score",null,"count"]
["No","Priority","Score","Rank",null,201,{"$f":"IF(Questions!D11,\"na\",H2)","v":""},{"$f":"IFERROR(LOOKUP(Questions!D11,dd!E2:E5,dd!F2:F5),\"\")","v":""},null,null,null,null,null,null,1,{"$f":"IF(R2=0,\"\",Q2/R2)","v":""},{"$f":"SUMIF(S2:W2,\">=0\")","v":0},{"$f":"COUNT(S2:W2)","v":0},{"$f":"H8","v":""},{"$f":"H13","v":""},{"$f":"H28","v":""},{"$f":"H29","v":""},{"$f":"H30","v":""}]
[1,"Automation offices and creation of internal databases","",1,null,203,null,{"$f":"IFERROR(LOOKUP(Questions!D12,dd!E7:E10,dd!F7:F10),\"\")","v":""},null,null,null,null,null,null,2,{"$f":"IF(R3=0,\"\",Q3/R3)","v":""},{"$f":"SUMIF(S3:W3,\">=0\")","v":0},{"$f":"COUNT(S3:W3)","v":0},{"$f":"H2","v":""},{"$f":"H3","v":""},{"$f":"H11","v":""},{"$f":"H12","v":""},{"$f":"H38","v":""}]
[2,"Network security plan","",2,null,209,null,{"$f":"IFERROR(LOOKUP(Questions!D13,dd!E12:E14,dd!F12:F14),\"\")","v":""},null,null,null,null,null,null,3,"",{"$f":"SUMIF(S4:W4,\">=0\")","v":0},{"$f":"COUNT(S4:V4)","v":0},{"$f":"H15","v":""},{"$f":"H16","v":""},{"$f":"H19","v":""},{"$f":"H21","v":""}]
[3,"Website development","",3,null,303,null,{"$f":"IF(Questions!D14=\"\",\"\",Questions!D14/10)","v":""},null,null,null,null,null,null,4,"",{"$f":"SUMIF(S5:W5,\">=0\")","v":0},{"$f":"COUNT(S5:W5)","v":0},{"$f":"H13","v":""},{"$f":"H18","v":""},{"$f":"H19","v":""},{"$f":"H23","v":""},{"$f":"H30","v":""}]
[4,"Transparency toward citizens on public documents and administrative transparency","",4,null,326,null,{"$f":"IF(Questions!D15=\"\",\"\",Questions!D15/10)","v":""},null,null,null,null,null,null,5,"",{"$f":"SUMIF(S6:V6,\">=0\")","v":0},{"$f":"COUNT(S6:V6)","v":0},{"$f":"H2","v":""},{"$f":"H4","v":""},{"$f":"H14","v":""},{"$f":"H40","v":""}]
[5,"Survey on digital level of other institutions and possible collaboration","",5,null,305,null,{"$f":"IF(Questions!D16=\"\",\"\",Questions!D16/10)","v":""},null,null,null,null,null,null,6,"",{"$f":"SUMIF(S7:W7,\">=0\")","v":0},{"$f":"COUNT(S7:W7)","v":0},{"$f":"H5","v":""},{"$f":"H6","v":""},{"$f":"H7","v":""},{"$f":"H8","v":""},{"$f":"H10","v":""}]
[6,"Development of an Intranet, a computer network that uses Internet Protocol technology to securely share any part of an organization's information","",6,null,306,null,{"$f":"IFERROR(LOOKUP(Questions!D17,dd!E16:E18,dd!F16:F18),\"\")","v":""},null,null,null,null,null,null,7,"",{"$f":"SUMIF(S8:U8,\">=0\")","v":0},{"$f":"COUNT(S8:U8)","v":0},{"$f":"H2","v":""},{"$f":"H22","v":""},{"$f":"H36","v":""}]
[7,"Open source strategy for development of new products and services ","",7,null,307,null,{"$f":"IFERROR(LOOKUP(Questions!D18,dd!E20:E22,dd!F20:F22),\"\")","v":""},null,null,null,null,null,null,8,"",{"$f":"SUMIF(S9:V9,\">=0\")","v":0},{"$f":"COUNT(S9:V9)","v":0},{"$f":"H9","v":""},{"$f":"H20","v":""},{"$f":"H25","v":""},{"$f":"H39","v":""}]
[8,"Analysis of infrastructural enabling services needed for development of advanced services ICT-based","",8,null,308,null,{"$f":"IF(Questions!D19=\"\",\"\",I10*10)","v":""},{"$f":"COUNTIF(Questions!D19,dd!B20)","v":0},null,null,null,null,null,9,"",{"$f":"SUMIF(S10:W10,\">=0\")","v":0},{"$f":"COUNT(S10:W10)","v":0},{"$f":"H19","v":""},{"$f":"H20","v":""},{"$f":"H21","v":""},{"$f":"H26","v":""},{"$f":"H27","v":""}]
[9,"ICT skills of PAs","",9,null,309,null,{"$f":"IF(Questions!D20=\"\",\"\",I11*10)","v":""},{"$f":"COUNTIF(Questions!D20,dd!B20)","v":0},null,null,null,null,null,10,"",{"$f":"SUMIF(S11:T11,\">=0\")","v":0},{"$f":"COUNT(S11:T11)","v":0},{"$f":"H20","v":""},{"$f":"H22","v":""}]
[10,"Stand alone services on web site","",10,null,311,null,{"$f":"IFERROR(LOOKUP(Questions!D21,dd!B24:B28,dd!C24:C28),\"\")","v":""},null,null,null,null,null,null,11,"",{"$f":"SUMIF(S12:V12,\">=0\")","v":0},0,{"$f":"H17","v":""},{"$f":"H18","v":""},{"$f":"H23","v":""},{"$f":"H24","v":""}]
[11,"Consultation via web to citizens, local enterprises and community organisations on specific issues","",11,null,401,null,{"$f":"IF(AND(Questions!D23=\"\",Questions!D24=\"\",Questions!D25=\"\",Questions!D26=\"\",Questions!D27=\"\",Questions!D28=\"\",Questions!D29=\"\",Questions!D30=\"\"),\"\",I13/(8-J13)*10)","v":""},{"$f":"COUNTIF(Questions!D23:D30,dd!B16)","v":0},{"$f":"COUNTIF(Questions!D23:D30,dd!B18)","v":0},null,null,null,null,12,"",{"$f":"SUMIF(S13:U13,\">=0\")","v":0},{"$f":"COUNT(S13:U13)","v":0},{"$f":"H6","v":""},{"$f":"H12","v":""},{"$f":"H14","v":""}]
[12,"Extranet with other institutions and development of integrated services (e.g. call center, common databases),  workflow management of internal procedures","",12,null,403,null,{"$f":"IF(Questions!D31=\"\",\"\",Questions!D31/10)","v":""},null,null,null,null,null,null,13,"",{"$f":"SUMIF(S14:T14,\">=0\")","v":0},{"$f":"COUNT(S14:T14)","v":0},{"$f":"H14","v":""},{"$f":"H35","v":""}]
[13,"Participation to civic networks / Pilot projects for services with other entities","",13,null,404,null,{"$f":"IF(Questions!D32=\"\",\"\",Questions!D32/10)","v":""},null,null,null,null,null,null,14,"",{"$f":"SUMIF(S15:V15,\">=0\")","v":0},0,{"$f":"H17","v":""},{"$f":"H18","v":""},{"$f":"H23","v":""},{"$f":"H28","v":""}]
[14,"Interactive services with citizens and SMEs (on-line front offices)","",14,null,406,null,{"$f":"IF(Questions!D33=\"\",\"\",Questions!D33/10)","v":""},null,null,null,null,null,null,15,"",{"$f":"SUMIF(S16:U16,\">=0\")","v":0},{"$f":"COUNT(S16:U16)","v":0},{"$f":"H20","v":""},{"$f":"H25","v":""},{"$f":"H37","v":""}]
[15,"Local web portal and multi-channel services","",15,null,407,null,{"$f":"IFERROR(LOOKUP(Questions!D34,dd!E24:E28,dd!F24:F28),\"\")","v":""},null,null,null,null,null,null,16,"",{"$f":"SUMIF(S17:V17,\">=0\")","v":0},0,{"$f":"H13","v":""},{"$f":"H23","v":""},{"$f":"H24","v":""},{"$f":"H29","v":""}]
[16,"E.participation initiatives","",16,null,409,null,{"$f":"IF(AND(Questions!D36=\"\",Questions!D37=\"\",Questions!D38=\"\",Questions!D39=\"\",Questions!D40=\"\"),\"\",MIN(10,I18))","v":""},{"$f":"IF(Questions!D35=100,0.08*Questions!D37+0.12*Questions!D38+0.15*Questions!D39+0.18*Questions!D40,0)","v":0},null,null,null,null,null,17,"",{"$f":"SUMIF(S18:T18,\">=0\")","v":0},{"$f":"COUNT(S18:T18)","v":0},{"$f":"H34","v":""},{"$f":"H41","v":""}]
[17,"Transnational e.government services","",17,null,415,null,{"$f":"IFERROR(LOOKUP(Questions!D41,dd!E30:E34,dd!F30:F34),\"\")","v":""},null,null,null,null,null,null,18,"",{"$f":"SUMIF(S19:W19,\">=0\")","v":0},{"$f":"COUNT(S19:W19)","v":0},{"$f":"H8","v":""},{"$f":"H13","v":""},{"$f":"H28","v":""},{"$f":"H29","v":""},{"$f":"H30","v":""}]
[18,"Workflow management of internal procedures","",18,null,416,null,{"$f":"IF(Questions!D42=\"\",\"\",MIN(10,Questions!D42*0.125))","v":""},null,null,null,null,null,null,19,"",{"$f":"SUMIF(S20:U20,\">=0\")","v":0},{"$f":"COUNT(S20:U20)","v":0},{"$f":"H20","v":""},{"$f":"H28","v":""},{"$f":"H27","v":""}]
{"$rows_left_out":22}
{"sheet":"intpol","index":6,"n_rows":219,"n_cols":4,"rows_kept":219,"cut":false,"hidden":false,"merged":[[210,1,212,1],[213,1,215,1],[216,1,218,1],[190,1,192,1],[193,1,195,1],[196,1,198,1],[200,1,202,1],[203,1,205,1],[206,1,208,1],[186,1,188,1],[150,1,152,1],[153,1,155,1],[156,1,158,1],[160,1,162,1],[163,1,165,1],[166,1,168,1],[170,1,172,1],[173,1,175,1],[176,1,178,1],[180,1,182,1],[183,1,185,1],[146,1,148,1],[110,1,112,1],[113,1,115,1],[116,1,118,1],[120,1,122,1],[123,1,125,1],[126,1,128,1],[130,1,132,1],[133,1,135,1],[136,1,138,1],[140,1,142,1],[143,1,145,1],[106,1,108,1],[70,1,72,1],[73,1,75,1],[76,1,78,1],[80,1,82,1],[83,1,85,1],[86,1,88,1],[90,1,92,1],[93,1,95,1],[96,1,98,1],[100,1,102,1],[103,1,105,1],[66,1,68,1],[30,1,32,1],[33,1,35,1],[36,1,38,1],[40,1,42,1],[43,1,45,1],[46,1,48,1],[50,1,52,1],[53,1,55,1],[56,1,58,1],[60,1,62,1],[63,1,65,1],[26,1,28,1],[10,1,12,1],[13,1,15,1],[16,1,18,1],[20,1,22,1],[23,1,25,1]]}
["This page is for calculations, while using the tool you do not need to touch it."]
[]
[]
[]
[]
[]
[]
[]
[]
["Priority",null,"Policy"]
[1,{"$f":"Policies!B23","v":"Low"},1,{"$f":"Policies!D23","v":"Prepare the development plan of information and communications technologies"}]
[null,null,2,{"$f":"Policies!D24","v":"Analyse the relation between paperless data flow and paper documents."}]
[null,null,3,{"$f":"Policies!D25","v":"Find opportunities for information flow in digital form"}]
[null,{"$f":"Policies!B26","v":"Medium"},1,{"$f":"Policies!D26","v":"Analyse activities and duties for determining work processes"}]
[null,null,2,{"$f":"Policies!D27","v":"Analyse and update development plan of information and communications technologies"}]
[null,null,3,{"$f":"Policies!D28","v":0}]
[null,{"$f":"Policies!B29","v":"Good"},1,{"$f":"Policies!D29","v":"Analyse the number of employees who are able to support the online services of local government."}]
[null,null,2,{"$f":"Policies!D30","v":"Conduct respective trainings with proficiency examination (e.g. ECDL)."}]
[null,null,3,{"$f":"Policies!D31","v":0}]
[null,null,null,{"$f":"Policies!D32","v":0}]
{"$rows_left_out":199}